{"text_format":"1","workbook":"xlsx","n_sheets":3,"sheets":["RA Worksheet","ORM Tools","Instructions"],"not_rendered":{"charts":0,"images":0,"macros":1,"external_links":0,"defined_names":7,"comments":1,"pivot_tables":0},"unopened":[],"bounds":{"document_bytes":16777216,"sheet_cells":100000,"rows_first":2000,"rows_last":500,"rows_between":2000,"halvings":0,"cell_chars":16384,"cell_head_chars":4096},"cells_cut":0,"cells_raw":0,"read":"whole","date_system":"1900"}

{"sheet":"RA Worksheet","index":0,"n_rows":40,"n_cols":21,"rows_kept":40,"cut":false,"hidden":false,"merged":[[6,16,6,20],[3,0,3,3],[3,4,3,6],[3,7,3,10],[4,0,4,10],[5,0,5,3],[5,4,5,6],[5,7,5,10],[6,0,6,1],[6,2,6,4],[6,6,6,8],[6,11,6,15],[2,0,2,3],[2,4,2,6],[2,7,2,10],[0,0,1,3],[0,4,0,6],[0,7,0,10],[1,4,1,6],[1,7,1,10]]}
["Risk Assessment Worksheet",null,null,null,"1. Project/Incident/Work Activity:",null,null,"2.  Location:"]
[null,null,null,null,"Emergency Vehicle Operations",null,null,"Fishlake National Forest"]
["3. Specific Objective:",null,null,null,"4.  Name and Title of Preparer:",null,null,"5.  Date Prepared:"]
["Provide clear risk information for utilizing EVO.",null,null,null,"Tyler Monroe, Forest FMO",null,null,"2023-01-17"]
["6.  Risk Decision Authority:  The risk decision authority block should be signed after the worksheet is completed. Use the Risk Decision Authority matrix to determine the authorization required to sign in block 6. \n"]
["Signature:",null,null,null,"Title:",null,null,"Date:"]
["Identify Hazards",null,"Assess Hazards",null,null,"Risk Control Options","Residual Risk",null,null,"Decision","Implement","Assessed Hazards",null,null,null,null,"Residual Risk"]
["7. Task","8. Hazard","9. Hazard Probability","10. Severity / Consequence","11. RAC","12. Identify hazard mitigations & abatement measures\n(press [alt + enter] to add a line)","13. Hazard Probability","14. Severity / Consequence","15. RAC","16. Task Necessary?","17. Hazard Control \nAssigned to:","Critical","Serious","Moderate","Minor","Negligible","Critical2","Serious3","Moderate4","Minor5","Negligible6"]
["Emergency Lighting and Siren Equipment & Configuration","Personnel unfamiliar with components.","Possible","Moderate                                           ",{"$f":"IFERROR(INDEX('ORM Tools'!$D$5:$H$12,MATCH(D9,('ORM Tools'!$C$5:$C$12),0),MATCH(C9,('ORM Tools'!$D$3:$H$3),0)),\"No Data\")","v":"Moderate"},"Training, briefings and placards.","Unlikely","Moderate                                           ",{"$f":"IFERROR(INDEX('ORM Tools'!$D$5:$H$12,MATCH(H9,('ORM Tools'!$C$5:$C$12),0),MATCH(G9,('ORM Tools'!$D$3:$H$3),0)),\"No Data\")","v":"Low"},"YES","Operator/Fire Management",{"$f":"IF(E9=\"Critical\",1,)","v":0},{"$f":"IF(E9=\"Serious\",1,)","v":0},{"$f":"IF(E9=\"Moderate\",1,)","v":1},{"$f":"IF(E9=\"Minor\",1,)","v":0},{"$f":"IF(E9=\"Negligible\",1,)","v":0},{"$f":"IF(I9=\"Critical\",1,)","v":0},{"$f":"IF(I9=\"Serious\",1,)","v":0},{"$f":"IF(I9=\"Moderate\",1,)","v":0},{"$f":"IF(I9=\"Minor\",1,)","v":0},{"$f":"IF(I9=\"Negligible\",1,)","v":0}]
[null,"Inaccessible or obtrusive user controls","Unlikely","Negligible                                                      ",{"$f":"IFERROR(INDEX('ORM Tools'!$D$5:$H$12,MATCH(D10,('ORM Tools'!$C$5:$C$12),0),MATCH(C10,('ORM Tools'!$D$3:$H$3),0)),\"No Data\")","v":"Low"},"Mount components in accessible and ergonomically correct manner. Use standardized control panels when feasible.","Unlikely","Negligible                                                      ",{"$f":"IFERROR(INDEX('ORM Tools'!$D$5:$H$12,MATCH(H10,('ORM Tools'!$C$5:$C$12),0),MATCH(G10,('ORM Tools'!$D$3:$H$3),0)),\"No Data\")","v":"Low"},null,"Operator",0,0,0,0,0,0,0,0,0,0]
[null,"Component failures: overheating, faulty wiring, unsecure mounting, etc.","Possible","Moderate                                           ",{"$f":"IFERROR(INDEX('ORM Tools'!$D$5:$H$12,MATCH(D11,('ORM Tools'!$C$5:$C$12),0),MATCH(C11,('ORM Tools'!$D$3:$H$3),0)),\"No Data\")","v":"Moderate"},"Use professional vendors or follow manufactures instructions completely.  Integrate inspection into preventative maintenance  checklist. Add to monthly and post incident inspections     ","Unlikely","Moderate                                           ",{"$f":"IFERROR(INDEX('ORM Tools'!$D$5:$H$12,MATCH(H11,('ORM Tools'!$C$5:$C$12),0),MATCH(G11,('ORM Tools'!$D$3:$H$3),0)),\"No Data\")","v":"Low"},null,"Operator/Fire Management",0,0,1,0,0,0,0,0,0,0]
["Enviroment","    Weather/poor visibility ","Almost Certain","Critical                                                   ",{"$f":"IFERROR(INDEX('ORM Tools'!$D$5:$H$12,MATCH(D12,('ORM Tools'!$C$5:$C$12),0),MATCH(C12,('ORM Tools'!$D$3:$H$3),0)),\"No Data\")","v":"Extremely High"},"Use NFPA compliant lights. Properly install reflective striping and use sirens as appropriate. Use operators trained and certified in emergency vehicle operations.  Never exceed posted speed limits. Stop at all controlled intersections and only proceed once all vehicles have yielded the ROW.  Use lights as appropriate to facilitate operational objectives.  Emergency vehicle operators (EVO) are required to operate at all times with safety of pedestrians, other vehicles and themselves as the primary objectives.  Consistent safe driving is a condition of EVO's certification (Hubbard Red Lights and Siren Interim Letter and FSH 6709.11, Chapter 10, Section 12.32 Emergency Driving). When driving in a reduced visibility environment the driver has to ensure that they are not following to closely. The driver should drive at a speed that allows them to stop within half the distance of sight. ","Unlikely","Critical                                                   ",{"$f":"IFERROR(INDEX('ORM Tools'!$D$5:$H$12,MATCH(H12,('ORM Tools'!$C$5:$C$12),0),MATCH(G12,('ORM Tools'!$D$3:$H$3),0)),\"No Data\")","v":"Moderate"},null,"Operator/Fire Management",0,0,0,0,0,0,0,1,0,0]
[null,"Vehicles/Animal collisions especially between dusk and twilight. ","Unlikely","Moderate                                           ",{"$f":"IFERROR(INDEX('ORM Tools'!$D$5:$H$12,MATCH(D13,('ORM Tools'!$C$5:$C$12),0),MATCH(C13,('ORM Tools'!$D$3:$H$3),0)),\"No Data\")","v":"Low"},"All personnel must be vigilant and help drivers look for animals. Drivers must slow to a safe speed. Module leaders must be aware of speeds and coach drivers on the proper speed for all situations.  When approaching large groups of animals shut of sirens to cause less confusion in the animals. ","Unlikely","Negligible                                                      ",{"$f":"IFERROR(INDEX('ORM Tools'!$D$5:$H$12,MATCH(H13,('ORM Tools'!$C$5:$C$12),0),MATCH(G13,('ORM Tools'!$D$3:$H$3),0)),\"No Data\")","v":"Low"},null,"Operator",0,0,0,0,0,0,0,0,0,0]
[null,"Residence or Community evacuation operations with risk associated with caravans of civilian vehicles lead by fire apparatus.                                                                                                                                                           ","Unlikely","Catastrophic                                ",{"$f":"IFERROR(INDEX('ORM Tools'!$D$5:$H$12,MATCH(D14,('ORM Tools'!$C$5:$C$12),0),MATCH(C14,('ORM Tools'!$D$3:$H$3),0)),\"No Data\")","v":"High"},"Use operators trained and certified in emergency vehicle operations which includes safe placement of apparatus at accident scenes and accident scene management.  Ensure lighting and striping meet FS Standards. Ensure firefighters use required reflective materials. Ensure site supervision is turned over to the proper jurisdiction as promptly as possible.","Unlikely","Negligible                                                      ",{"$f":"IFERROR(INDEX('ORM Tools'!$D$5:$H$12,MATCH(H14,('ORM Tools'!$C$5:$C$12),0),MATCH(G14,('ORM Tools'!$D$3:$H$3),0)),\"No Data\")","v":"Low"},null,"Operator/Fire Management",0,0,0,0,0,0,0,0,0,0]
[null,"Operations on or near roadways with potential for civilian collisions with apparatus or firefighters.","Possible","Catastrophic                                ",{"$f":"IFERROR(INDEX('ORM Tools'!$D$5:$H$12,MATCH(D15,('ORM Tools'!$C$5:$C$12),0),MATCH(C15,('ORM Tools'!$D$3:$H$3),0)),\"No Data\")","v":"Extremely High"},"Use operators trained and certified in emergency vehicle operations which includes safe placement of apparatus at accident scenes and accident scene management.  Ensure lighting and striping meet FS Standards. Ensure firefighters use required reflective materials. Ensure site supervision is turned over to the proper jurisdiction as promptly as possible.  DO NOT ENGAGE if safety cannot be accounted for.","Possible","Moderate                                           ",{"$f":"IFERROR(INDEX('ORM Tools'!$D$5:$H$12,MATCH(H15,('ORM Tools'!$C$5:$C$12),0),MATCH(G15,('ORM Tools'!$D$3:$H$3),0)),\"No Data\")","v":"Moderate"},null,"Operator/Fire Management",0,0,0,0,0,0,0,1,0,0]
["Scene Management Emegency Operations","Parking adjacent to roadways or engaging in road blocking operations with potential for traffic collisions with fire apparatus.","Likely","Critical                                                   ",{"$f":"IFERROR(INDEX('ORM Tools'!$D$5:$H$12,MATCH(D16,('ORM Tools'!$C$5:$C$12),0),MATCH(C16,('ORM Tools'!$D$3:$H$3),0)),\"No Data\")","v":"Extremely High"},"Use operators trained and certified in emergency vehicle operations which includes safe placement of apparatus at accident scenes and accident scene management.  Ensure lighting and striping meet FS Standards. Ensure firefighters use required reflective materials. Ensure site supervision is turned over to the proper jurisdiction as promptly as possible.","Likely","Negligible                                                      ",{"$f":"IFERROR(INDEX('ORM Tools'!$D$5:$H$12,MATCH(H16,('ORM Tools'!$C$5:$C$12),0),MATCH(G16,('ORM Tools'!$D$3:$H$3),0)),\"No Data\")","v":"Moderate"},"YES","Operator/Fire Management",0,0,0,0,0,0,0,1,0,0]
[null,"Public being attracted to RLS response scene. ","Likely","Moderate                                           ",{"$f":"IFERROR(INDEX('ORM Tools'!$D$5:$H$12,MATCH(D17,('ORM Tools'!$C$5:$C$12),0),MATCH(C17,('ORM Tools'!$D$3:$H$3),0)),\"No Data\")","v":"High"},"Request Law enforcement when needed to provide for flaggers. ","Rare","Negligible                                                      ",{"$f":"IFERROR(INDEX('ORM Tools'!$D$5:$H$12,MATCH(H17,('ORM Tools'!$C$5:$C$12),0),MATCH(G17,('ORM Tools'!$D$3:$H$3),0)),\"No Data\")","v":"Low"},null,"Operator",0,0,0,0,0,0,0,0,0,0]
["Driving with Red, Lights and Sirens","Sense of urgency, heightened by social or cultural pressure to accept unreasonable risks particularly with respect to vehicle speed, operations in dense smoke and WUI operations.","Possible","Critical                                                   ",{"$f":"IFERROR(INDEX('ORM Tools'!$D$5:$H$12,MATCH(D18,('ORM Tools'!$C$5:$C$12),0),MATCH(C18,('ORM Tools'!$D$3:$H$3),0)),\"No Data\")","v":"High"},"Use operators trained and certified in emergency vehicle operations.  Require refresher training every 3 years. Supervisors, FMOs and Line Officers will monitor and supervise operators performance. Review all close calls and near misses, share and discuss these reviews at the District, Forest and Regional Level. Use AARs after every RLS mission creating a culture of  peer pressure to reject risky behavior. Discuss crew resource management techniques and encourage employees to speak up and challenge risky behavior.  Line Officers and FMOs follow up on reports and stories of unreasonable risk taking.  Reinforce that \"EVOs are required to operate at all times with the safety of pedestrians, other vehicles and themselves as the primary objective.  Consistent safe driving is a condition of EVOs certification. Inform all emergency operators, in writing, of their personal and legal responsibilities to operate in accordance with their training, State and Local laws and regulations, Forest Service policies and due caution for life and property (Hubbard Red Lights and Siren Interim Letter). ","Rare","Critical                                                   ",{"$f":"IFERROR(INDEX('ORM Tools'!$D$5:$H$12,MATCH(H18,('ORM Tools'!$C$5:$C$12),0),MATCH(G18,('ORM Tools'!$D$3:$H$3),0)),\"No Data\")","v":"Moderate"},"YES","Fire Management",0,0,0,0,0,0,0,1,0,0]
[null,"Increased risk of Collision ","Possible","Catastrophic                                ",{"$f":"IFERROR(INDEX('ORM Tools'!$D$5:$H$12,MATCH(D19,('ORM Tools'!$C$5:$C$12),0),MATCH(C19,('ORM Tools'!$D$3:$H$3),0)),\"No Data\")","v":"Extremely High"},"Driver must take into consideration the type of road bed and adjust accordingly (i.e. gravel or dirt roads) Drive in a manner that provides for the ability to relinquish at least half of road bed, at any time to oncoming traffic.  Red Lights and sirens shall be used in situations on public roads, only when the benefits to public justify the increased risks.  Certification as an EVO does not constitute approval for the use of red lights and sirens.  Regions and Forests may restrict the use of Red lights and Sirens to predefined situations or require a second level of approval such as a concurrence from the duty officer or line officer, etc. (Hubbard Red Lights and Sirens Interim Letter).","Unlikely","Catastrophic                                ",{"$f":"IFERROR(INDEX('ORM Tools'!$D$5:$H$12,MATCH(H19,('ORM Tools'!$C$5:$C$12),0),MATCH(G19,('ORM Tools'!$D$3:$H$3),0)),\"No Data\")","v":"High"},null,"Operator",0,0,0,0,0,0,0,0,0,0]
[null,"Operations in rural areas near unsupervised children with the potential of child/vehicle collisions","Possible","Catastrophic                                ",{"$f":"IFERROR(INDEX('ORM Tools'!$D$5:$H$12,MATCH(D20,('ORM Tools'!$C$5:$C$12),0),MATCH(C20,('ORM Tools'!$D$3:$H$3),0)),\"No Data\")","v":"Extremely High"},"Use operators trained and certified in emergency vehicle operations. Turn off RLS and proceed only with the flow of traffic in the vicinity of active school crossings and other areas where young children are present.","Unlikely","Catastrophic                                ",{"$f":"IFERROR(INDEX('ORM Tools'!$D$5:$H$12,MATCH(H20,('ORM Tools'!$C$5:$C$12),0),MATCH(G20,('ORM Tools'!$D$3:$H$3),0)),\"No Data\")","v":"High"},null,"Operator/Fire Management",0,0,0,0,0,0,0,0,0,0]
{"$rows_left_out":21}
{"sheet":"ORM Tools","index":1,"n_rows":34,"n_cols":14,"rows_kept":34,"cut":false,"hidden":false,"merged":[[1,9,1,14],[2,9,3,10],[2,11,3,12],[2,13,3,14],[8,9,9,10],[10,9,11,10],[4,11,5,12],[4,13,5,14],[6,11,7,12],[6,13,7,14],[8,11,9,12],[8,13,9,14],[10,11,11,12],[10,13,11,14],[27,9,29,14],[30,9,30,14],[31,9,33,14],[26,1,26,5],[26,7,27,7],[28,7,29,7],[30,7,31,7],[32,7,33,7],[32,1,32,5],[33,1,33,5],[27,1,27,5],[28,1,28,5],[29,1,29,5],[30,1,30,5],[31,1,31,5],[26,9,26,14],[12,9,16,14],[22,9,22,14],[4,9,5,10],[6,9,7,10],[17,1,17,2],[15,1,15,2],[16,1,16,2],[15,3,15,7],[16,3,16,7],[17,3,17,7],[17,9,17,14],[18,9,18,14],[19,1,19,7],[19,9,21,14],[20,3,20,7],[21,3,21,7],[1,1,3,2],[1,3,1,7],[12,1,14,7],[4,1,11,1],[4,3,5,3],[4,4,5,4],[4,5,5,5],[4,6,5,6],[8,3,9,3],[8,4,9,4],[8,5,9,5],[8,6,9,6],[4,7,5,7],[6,3,7,3],[6,4,7,4],[6,5,7,5],[18,3,18,7],[18,1,18,2],[20,1,20,2],[21,1,21,2],[23,3,23,7],[23,9,25,14],[24,1,24,2],[24,3,24,7],[22,1,22,2],[23,1,23,2],[22,3,22,7],[25,1,25,7],[6,6,7,6],[6,7,7,7],[8,7,9,7],[10,3,11,3],[10,4,11,4],[10,5,11,5],[10,6,11,6],[10,7,11,7]]}
[]
[null,"Risk Assessment Matrix",null,"Probability                                                                                                                                     \nLikelihood of Mishap if Hazard is Present",null,null,null,null,null,"Risk Decision Authority"]
[null,null,null,"Almost Certain","Likely","Possible","Unlikely","Rare",null,"Risk Assessment Codes",null,"Project/Work Activity",null,"Incident"]
[null,null,null," (Continuously\nexperienced)"," (Will occur frequently)"," (Will occur several times)","(Remotely possible but not probable)","(Improbable; but has occurred in the past)"]
[{"$f":"C5","v":"Catastrophic                                "},"Severity/ Consequences                                             Consequence if Mishap Occurs","Catastrophic                                ","Extremely High","Extremely High","Extremely High","High","Moderate",null,"Extremely High",null,"USFS Line Officer",null,"Incident Commander T3+ or \nAgency Administer"]
[{"$f":"C7","v":"Critical                                                   "},null,"(Imminent and immediate danger of death or permanent disability; major property or facility damage; loss of critical system or equipment)"]
[{"$f":"C9","v":"Moderate                                           "},null,"Critical                                                   ","Extremely High","Extremely High","High","Moderate","Moderate",null,"High",null,"USFS Line Officer",null,"Incident Commander T3+ or \nAgency Administer"]
[{"$f":"C11","v":"Negligible                                                      "},null,"(Permanent partial disability, temporary total disability; moderate environmental damage; extensive damage to equipment)"]
[null,null,"Moderate                                           ","High","High","Moderate","Low","Low",null,"Moderate",null,"Supervisor or Lead",null,"Incident Commander T3+ or \nAgency Administer"]
[null,null,"(Hospitalized minor injury, reversible illness; minor damage to equipment, property or the environment)"]
[null,null,"Negligible                                                      ","Moderate","Moderate","Low","Low","Low",null,"Low",null,"Individual",null,"Incident Commander T3+ or \nAgency Administer"]
[null,null,"(First aid or minor medical treatment; little or no property or environmental damage)"]
[null,"Severity/Consequences:  This category is defined as an event's potential consequences related to meeting objectives.  In safety related assessments it refers to the degree of damage or injury, to a human.  In project related assessments it refers to the impact on a project/incident/work activity.  Should something go wrong, the results are likely to occur in one of these areas - Failure to meet objective, Injury or Death, equipment damage, project/fire operations degradation, adverse publicity, environmental damage, property damage, etc. Severity/consequences categories are shown in the top portion of the matrix and are ranked by using four categories.",null,null,null,null,null,null,null,"Risk Decision Authority: Risk decision authority defines who should approve projects at each risk level and to ensure that all personnel understand the approval process. A key element of the risk decision process is determining if the risk is necessary. This decision must be made at the appropriate level by the individual who can balance the risk against the potential benefit and value. This individual decides if controls are sufficient and acceptable and whether to accept the resulting residual risk. These risk-based decisions should not be made in a silo but instead should be made in collaboration with employees who are impacted by these decisions and other stakeholders.\nUltimately, acceptance of the residual risk is decided by the employees who are exposed to the hazards. If they are not comfortable with the risk remaining after controls are in place, further assessment needs to occur with their input. \n"]
[]
[]
[null,"Catastrophic ",null,"Impact to objective (Imminent and immediate danger of death or permanent disability; major property or facility damage; loss of critical system or equipment)."]
[null,"Critical",null,"Impact to objective (Permanent partial disability, temporary total disability; moderate environmental damage; extensive damage to equipment)."]
[null,"Moderate",null,"Impact to objective (Hospitalized minor injury, reversible illness; minor damage to equipment, property or the environment).",null,null,null,null,null,"Operational Risk Management Principles"]
[null,"Negligible",null,"Impact to objective (First aid or minor medical treatment; little or no property or environmental damage).",null,null,null,null,null,"Accept No Unnecessary Risk"]
[null,"Probability:  The likelihood that the potential consequences will occur, is found on the left-hand side of the matrix, and is calculated using four categories.",null,null,null,null,null,null,null,"All fire operations and daily routines entail risk. Unnecessary risk is any risk that, if taken, will not contribute meaningfully to the mission or task accomplishment or will needlessly jeopardize personnel or equipment. The most logical courses of action for accomplishing a project/fire operation are those that meet objectives while exposing personnel and resources to the lowest possible risk. ORM provides tools to determine which risk or what degree of risk is unnecessary."]
{"$rows_left_out":15}
{"sheet":"Instructions","index":2,"n_rows":47,"n_cols":2,"rows_kept":47,"cut":false,"hidden":false,"merged":[]}
[null,"The Risk Assessment Worksheet will identify the hazards associated with a project, incident or work activity assessing initial risk, mitigations and post mitigation risk.  The table will autopopulate the next line as you input an entry into the next line. Do not copy and paste into the worksheet over in blocks 9-11 and blocks 13-15 to prevent errors in the worksheet. "]
[]
["Block 1","Name of project, incident or work activty"]
["Block 2","Location of project, incident or work activity"]
["Block 3","Specific Objective "]
["Block 4","Name and title of person preparing the Risk Assesment Worksheet"]
["Block 5","Date that the preparer filled out the Risk Assesment Worksheet"]
["Block 6","Use the Risk Decision Authority matrix to determine the authorization required to sign in block 6.  The intent is to brief the Risk Decision Authority on the Control Measures used to reduce risks.  "]
[null,"Identify Hazards:  See instructions for blocks 7-8"]
["Block 7","Task: task to be assessed (Driving, tree falling, stream assessment, mop up)"]
["Block 8","Hazards:  Identify hazards (low visibility, overhead hazard, swift current, stump holes)  "]
[null,"Assess Hazards: See instructions for blocks 9-11"]
["Block 9","Hazard Probability: Probability a hazard will be encountered during task.  Select from drop down box.   "]
["Block 10","Severity/Consequence: Consequences should an event occur.  Select from drop down box.  "]
["Block 11","Risk Assessment Code (RAC):  When blocks 09 and 10 are populated a Risk Assesment Code (RAC) will be automatically assigned."]
[null,"Risk Control Options:   Identify mitigation and abatement measures in block 12"]
["Block 12","List all mitigation or abatement measures: What mitigation or abatement strategies will eliminate or minimize residual risk (ex. engineering, administrative, PPE, Avoidance, education, etc.)"]
[null,"Residual Risk:  See instructions for blocks 13-15."]
["Block 13","Hazard Probabilty:  Probability following mitigation or abatement actions.  Select from drop down box."]
["Block 14","Severity/Consequence:  Severity/consequence following mitigation or abatement actions. Select from drop down box."]
{"$rows_left_out":27}